Target
Neutrophil elastase
Ligand
BDBM50406285
Substrate
Meas. Tech.
ChEMBL_21101 (CHEMBL633695)
Ki
1.259E1±n/a nM
KOFF
5.623E-5 s-1
KON
4.677E3 M-1s-1
Citation
 Krantz, ASpencer, RWTam, TFLiak, TJCopp, LJThomas, EMRafferty, SP Design and synthesis of 4H-3,1-benzoxazin-4-ones as potent alternate substrate inhibitors of human leukocyte elastase. J Med Chem 33:464-79 (1990)  
Target
Name:
Neutrophil elastase
Synonyms:
Bone marrow serine protease Coagulation factor X ELANE Elastase HLE Leukocyte elastase Medullasin Neutrophil elastase (HNE) PMN elastase Trypsin
Type:
Enzyme
Mol. Mass.:
28532.38
Organism:
Homo sapiens (Human)
Description:
P08246
Residue:
267
  
Inhibitor
Name:
BDBM50406285
Synonyms:
CHEMBL145583
Type:
Small organic molecule
Emp. Form.:
C17H22N2O4
Mol. Mass.:
318.3676
SMILES:
CCc1cccc2nc(N[C@@H](CC(C)C)C(=O)OC)oc(=O)c12
: