Target
Neutrophil elastase
Ligand
BDBM50291753
Substrate
Meas. Tech.
ChEMBL_21101 (CHEMBL633695)
Ki
3.162E1±n/a nM
KOFF
1.778E-3 s-1
KON
5.248E4 M-1s-1
Citation
 Krantz, ASpencer, RWTam, TFLiak, TJCopp, LJThomas, EMRafferty, SP Design and synthesis of 4H-3,1-benzoxazin-4-ones as potent alternate substrate inhibitors of human leukocyte elastase. J Med Chem 33:464-79 (1990)  
Target
Name:
Neutrophil elastase
Synonyms:
Bone marrow serine protease Coagulation factor X ELANE Elastase HLE Leukocyte elastase Medullasin Neutrophil elastase (HNE) PMN elastase Trypsin
Type:
Enzyme
Mol. Mass.:
28532.38
Organism:
Homo sapiens (Human)
Description:
P08246
Residue:
267
  
Inhibitor
Name:
BDBM50291753
Synonyms:
2-Ethylamino-5-methyl-benzo[d][1,3]oxazin-4-one | CHEMBL142781
Type:
Small organic molecule
Emp. Form.:
C11H12N2O2
Mol. Mass.:
204.2252
SMILES:
CCNc1nc2cccc(C)c2c(=O)o1
: