Target
Neutrophil elastase
Ligand
BDBM50406209
Substrate
Meas. Tech.
ChEMBL_21101 (CHEMBL633695)
Ki
5.012E3±n/a nM
KOFF
4.169E-2 s-1
KON
8.71E3 M-1s-1
Citation
 Krantz, ASpencer, RWTam, TFLiak, TJCopp, LJThomas, EMRafferty, SP Design and synthesis of 4H-3,1-benzoxazin-4-ones as potent alternate substrate inhibitors of human leukocyte elastase. J Med Chem 33:464-79 (1990)  
Target
Name:
Neutrophil elastase
Synonyms:
Bone marrow serine protease Coagulation factor X ELANE Elastase HLE Leukocyte elastase Medullasin Neutrophil elastase (HNE) PMN elastase Trypsin
Type:
Enzyme
Mol. Mass.:
28532.38
Organism:
Homo sapiens (Human)
Description:
P08246
Residue:
267
  
Inhibitor
Name:
BDBM50406209
Synonyms:
CHEMBL343202
Type:
Small organic molecule
Emp. Form.:
C9H7NO2
Mol. Mass.:
161.1574
SMILES:
Cc1nc2ccccc2c(=O)o1
: