Target
Prostaglandin G/H synthase 1/2
Ligand
BDBM50008992
Substrate
Meas. Tech.
ChEMBL_177028 (CHEMBL781696)
IC50
>300000±n/a nM
Citation
 Bruneau, PDelvare, CEdwards, MPMcMillan, RM Indazolinones, a new series of redox-active 5-lipoxygenase inhibitors with built-in selectivity and oral activity. J Med Chem 34:1028-36 (1991)  
Target
Name:
Prostaglandin G/H synthase 1/2
Synonyms:
Cyclooxygenase
Type:
Mol. Mass.:
Description:
ASSAY_ID of ChEMBL is 1666355
Components:
This complex has 2 components.
Component 1
Name:
Prostaglandin G/H synthase 2
Synonyms:
Cox-2 Cyclooxygenase Ptgs2
Type:
Enzyme Catalytic Domain
Mol. Mass.:
69173.51
Organism:
RAT
Description:
COX-2 0 RAT::P35355
Residue:
604
  
Component 2
Name:
Prostaglandin G/H synthase 1
Synonyms:
Cox-1 Cyclooxygenase PGH1_RAT Ptgs1
Type:
Enzyme Catalytic Domain
Mol. Mass.:
69033.56
Organism:
RAT
Description:
COX-1 0 RAT::Q63921
Residue:
602
  
Inhibitor
Name:
BDBM50008992
Synonyms:
2-Pyridin-3-ylmethyl-1,2-dihydro-indazol-3-one | CHEMBL3144579
Type:
Small organic molecule
Emp. Form.:
C13H11N3O
Mol. Mass.:
225.2459
SMILES:
O=c1n(Cc2cccnc2)[nH]c2ccccc12
: