Target
Prostaglandin G/H synthase 1/2
Ligand
BDBM50008999
Substrate
Meas. Tech.
ChEMBL_177028 (CHEMBL781696)
IC50
>100000±n/a nM
Citation
 Bruneau, PDelvare, CEdwards, MPMcMillan, RM Indazolinones, a new series of redox-active 5-lipoxygenase inhibitors with built-in selectivity and oral activity. J Med Chem 34:1028-36 (1991)  
Target
Name:
Prostaglandin G/H synthase 1/2
Synonyms:
Cyclooxygenase
Type:
Mol. Mass.:
Description:
ASSAY_ID of ChEMBL is 1666355
Components:
This complex has 2 components.
Component 1
Name:
Prostaglandin G/H synthase 2
Synonyms:
Cox-2 Cyclooxygenase Ptgs2
Type:
Enzyme Catalytic Domain
Mol. Mass.:
69173.51
Organism:
RAT
Description:
COX-2 0 RAT::P35355
Residue:
604
  
Component 2
Name:
Prostaglandin G/H synthase 1
Synonyms:
Cox-1 Cyclooxygenase PGH1_RAT Ptgs1
Type:
Enzyme Catalytic Domain
Mol. Mass.:
69033.56
Organism:
RAT
Description:
COX-1 0 RAT::Q63921
Residue:
602
  
Inhibitor
Name:
BDBM50008999
Synonyms:
5-Methyl-2-[2-(naphthalen-2-yloxy)-ethyl]-2,4-dihydro-pyrazol-3-one 5-Methyl-2-[2-(naphthalen-2-yloxy)-ethyl]-2,4-dihydro-pyrazol-3-one(nafazatrom) Nafazatrom
Type:
Small organic molecule
Emp. Form.:
C16H16N2O2
Mol. Mass.:
268.3104
SMILES:
Cc1cc(=O)n(CCOc2ccc3ccccc3c2)[nH]1
: