Target
Polyunsaturated fatty acid 5-lipoxygenase
Ligand
BDBM50000540
Substrate
Meas. Tech.
ChEMBL_98489 (CHEMBL879813)
EC50
130000±n/a nM
Citation
 Bruneau, PDelvare, CEdwards, MPMcMillan, RM Indazolinones, a new series of redox-active 5-lipoxygenase inhibitors with built-in selectivity and oral activity. J Med Chem 34:1028-36 (1991)  
Target
Name:
Polyunsaturated fatty acid 5-lipoxygenase
Synonyms:
5-LO 5-Lipoxygenase (5-LO) 5-Lipoygenase ALOX5 LOG5 | LOX5_HUMAN
Type:
Enzyme
Mol. Mass.:
77972.74
Organism:
Homo sapiens (Human)
Description:
Recombinant protein was purified from E. coli lysate. After ammonium sulfate precipitation and subsequent steps, the supernatant (S100) was used for 5-LO activity assay.
Residue:
674
  
Inhibitor
Name:
BDBM50000540
Synonyms:
1-(3-Trifluoromethyl-phenyl)-4,5-dihydro-1H-pyrazol-3-ylamine 1-(3-Trifluoromethyl-phenyl)-4,5-dihydro-1H-pyrazol-3-ylamine(BW 755 C) 1-(3-trifluoromethylphenyl)-4,5-dihydro-1H-3-pyrazolamine CHEMBL274642
Type:
Small organic molecule
Emp. Form.:
C10H10F3N3
Mol. Mass.:
229.2017
SMILES:
NC1=NN(CC1)c1cccc(c1)C(F)(F)F
: