Target
Adenosine receptor A1
Ligand
BDBM50406504
Substrate
Meas. Tech.
ChEBML_29274
EC50
11482±n/a nM
Citation
 Ueeda, MThompson, RDArroyo, LHOlsson, RA 2-aralkoxyadenosines: potent and selective agonists at the coronary artery A2 adenosine receptor. J Med Chem 34:1340-4 (1991)  
Target
Name:
Adenosine receptor A1
Synonyms:
A1 adenosine receptor ADENOSINE A1 ADENOSINE A1 low Adenosine A1 receptor | Adenosine Receptor A1
Type:
Enzyme Catalytic Domain
Mol. Mass.:
36501.39
Organism:
GUINEA PIG
Description:
ADENOSINE A1 ADORA1 GUINEA PIG::P47745
Residue:
326
  
Inhibitor
Name:
BDBM50406504
Synonyms:
CHEMBL605878
Type:
Small organic molecule
Emp. Form.:
C22H23N5O5
Mol. Mass.:
437.4485
SMILES:
Nc1nc(OCCc2ccc3ccccc3c2)nc2n(cnc12)C1O[C@@H](CO)[C@H](O)[C@@H]1O
: