Target
Thymidylate synthase
Ligand
BDBM50006687
Substrate
Meas. Tech.
ChEBML_209982
Ki
31±n/a nM
Citation
 Bisset, GMPawelczak, KJackman, ALCalvert, AHHughes, LR Syntheses and thymidylate synthase inhibitory activity of the poly-gamma-glutamyl conjugates of N-[5-[N-(3,4-dihydro-2-methyl-4-oxoquinazolin-6-ylmethyl)-N-methylamino ]-2-thenoyl]-L-glutamic acid (ICI D1694) and other quinazoline antifolates. J Med Chem 35:859-66 (1992)  
Target
Name:
Thymidylate synthase
Synonyms:
TS TYSY_MOUSE | Tyms
Type:
PROTEIN
Mol. Mass.:
34957.15
Organism:
Mus musculus
Description:
ChEMBL_1340097
Residue:
307
  
Inhibitor
Name:
BDBM50006687
Synonyms:
(S)-2-(4-(((2-methyl-4-oxo-3,4-dihydroquinazolin-6-yl)methyl)(prop-2-ynyl)amino)benzamido)pentanedioic acid 2-{4-[(2-Methyl-4-oxo-3,4-dihydro-quinazolin-6-ylmethyl)-prop-2-ynyl-amino]-benzoylamino}-pentanedioic acid 2-{4-[1-(2-Methyl-4-oxo-3,4-dihydro-quinazolin-6-ylmethyl)-prop-2-ynyl]-benzoylamino}-pentanedioic acid | CHEMBL434209
Type:
Small organic molecule
Emp. Form.:
C25H24N4O6
Mol. Mass.:
476.4813
SMILES:
Cc1nc2ccc(CN(CC#C)c3ccc(cc3)C(=O)N[C@@H](CCC(O)=O)C(O)=O)cc2c(=O)[nH]1
: