Target
Thymidylate synthase
Ligand
BDBM50406721
Substrate
Meas. Tech.
ChEBML_209982
Ki
0.590000±n/a nM
Citation
 Bisset, GMPawelczak, KJackman, ALCalvert, AHHughes, LR Syntheses and thymidylate synthase inhibitory activity of the poly-gamma-glutamyl conjugates of N-[5-[N-(3,4-dihydro-2-methyl-4-oxoquinazolin-6-ylmethyl)-N-methylamino ]-2-thenoyl]-L-glutamic acid (ICI D1694) and other quinazoline antifolates. J Med Chem 35:859-66 (1992)  
Target
Name:
Thymidylate synthase
Synonyms:
TS TYSY_MOUSE | Tyms
Type:
PROTEIN
Mol. Mass.:
34957.15
Organism:
Mus musculus
Description:
ChEMBL_1340097
Residue:
307
  
Inhibitor
Name:
BDBM50406721
Synonyms:
CHEMBL171226
Type:
Small organic molecule
Emp. Form.:
C30H30FN5O9
Mol. Mass.:
623.5857
SMILES:
Cc1nc2ccc(CN(CC#C)c3ccc(C(=O)N[C@@H](CCC(=O)N[C@@H](CCC(O)=O)C(O)=O)C(O)=O)c(F)c3)cc2c(=O)[nH]1
: