Target
3-oxo-5-alpha-steroid 4-dehydrogenase 2
Ligand
BDBM50004955
Substrate
Meas. Tech.
ChEMBL_204747 (CHEMBL805440)
Ki
230±n/a nM
Citation
 Holt, DAYamashita, DSKonialian-Beck, ALLuengo, JIAbell, ADBergsma, DJBrandt, MLevy, MA Benzophenone- and indolecarboxylic acids: potent type-2 specific inhibitors of human steroid 5 alpha-reductase. J Med Chem 38:13-5 (1995)  
Target
Name:
3-oxo-5-alpha-steroid 4-dehydrogenase 2
Synonyms:
3-oxo-5-alpha-steroid 4-dehydrogenase 2 5α-Reductase 2 (5α-R2) SR type 2 Steroid 5-alpha-reductase Type II 5-alpha reductase
Type:
Enzyme
Mol. Mass.:
28406.59
Organism:
Homo sapiens (Human)
Description:
P31213
Residue:
254
  
Inhibitor
Name:
BDBM50004955
Synonyms:
1H-Indole-2-carboxylic acid Indol-2-carboxylic acid | Indole-2-carboxylate
Type:
Small organic molecule
Emp. Form.:
C9H7NO2
Mol. Mass.:
161.1574
SMILES:
OC(=O)c1cc2ccccc2[nH]1
: