Target
5-hydroxytryptamine receptor 2C
Ligand
BDBM50033437
Substrate
Meas. Tech.
ChEMBL_2738 (CHEMBL617297)
IC50
>10000±n/a nM
Citation
 Street, LJBaker, RDavey, WBGuiblin, ARJelley, RAReeve, AJRoutledge, HSternfeld, FWatt, APBeer, MS Synthesis and serotonergic activity of N,N-dimethyl-2-[5-(1,2,4-triazol-1-ylmethyl)-1H-indol-3-yl]ethylamine and analogues: potent agonists for 5-HT1D receptors. J Med Chem 38:1799-810 (1995)  
Target
Name:
5-hydroxytryptamine receptor 2C
Synonyms:
5-HT-2C 5-HT2C-INI 5-HTR2C 5-hydroxytryptamine receptor 2C (5-HT-2C) 5HT-1C HTR1C Serotonin (5-HT3) receptor Serotonin Receptor 2C
Type:
G Protein-Coupled Receptor (GPCR)
Mol. Mass.:
51836.79
Organism:
Homo sapiens (Human)
Description:
P28335
Residue:
458
  
Inhibitor
Name:
BDBM50033437
Synonyms:
CHEMBL905 N,N-dimethyl-2-[5-(1,2,4-triazol-1-ylmethyl)-1H-indol-3-yl]-ethanamine N,N-dimethyl-5-(1H-1,2,4-triazol-1-ylmethyl)-1H-indole-3-ethanamine risatriptan
Type:
Small organic molecule
Emp. Form.:
C15H19N5
Mol. Mass.:
269.3449
SMILES:
CN(C)CCc1c[nH]c2ccc(Cn3cncn3)cc12
: