Target
5-hydroxytryptamine receptor 1D
Ligand
BDBM50407361
Substrate
Meas. Tech.
ChEMBL_1961 (CHEMBL875911)
IC50
7.94±n/a nM
Citation
 Street, LJBaker, RDavey, WBGuiblin, ARJelley, RAReeve, AJRoutledge, HSternfeld, FWatt, APBeer, MS Synthesis and serotonergic activity of N,N-dimethyl-2-[5-(1,2,4-triazol-1-ylmethyl)-1H-indol-3-yl]ethylamine and analogues: potent agonists for 5-HT1D receptors. J Med Chem 38:1799-810 (1995)  
Target
Name:
5-hydroxytryptamine receptor 1D
Synonyms:
5HT1D_PIG Serotonin 1d (5-HT1d) receptor
Type:
PROTEIN
Mol. Mass.:
32680.56
Organism:
Sus scrofa
Description:
ChEMBL_1963
Residue:
291
  
Inhibitor
Name:
BDBM50407361
Synonyms:
CHEMBL53764
Type:
Small organic molecule
Emp. Form.:
C16H20N4
Mol. Mass.:
268.3568
SMILES:
CN(C)CCc1c[nH]c2ccc(cc12)-n1ccnc1C
: