Target
5-hydroxytryptamine receptor 1B
Ligand
BDBM50035057
Substrate
Meas. Tech.
ChEMBL_1819 (CHEMBL616791)
Ki
53.7±n/a nM
Citation
 Peglion, JLCanton, HBervoets, KAudinot, VBrocco, MGobert, ALe Marouille-Girardon, SMillan, MJ Characterization of potent and selective antagonists at postsynaptic 5-HT1A receptors in a series of N4-substituted arylpiperazines. J Med Chem 38:4044-55 (1995)  
Target
Name:
5-hydroxytryptamine receptor 1B
Synonyms:
5-HT-1B 5-hydroxytryptamine receptor 1B (5HT1B) 5ht1b Serotonin 1 (5-HT1) receptor Serotonin receptor 1B
Type:
Protein
Mol. Mass.:
43173.33
Organism:
Rattus norvegicus (Rat)
Description:
P28564
Residue:
386
  
Inhibitor
Name:
BDBM50035057
Synonyms:
(eltoprazine)1-(2,3-Dihydro-benzo[1,4]dioxin-5-yl)-piperazine CHEMBL282614 | Eltoprazine
Type:
Small organic molecule
Emp. Form.:
C12H16N2O2
Mol. Mass.:
220.2676
SMILES:
C1CN(CCN1)c1cccc2OCCOc12
: