Target
Dihydrofolate reductase
Ligand
BDBM50407727
Substrate
Meas. Tech.
ChEMBL_53000 (CHEMBL858265)
Ki
7.94±n/a nM
Citation
 Marlowe, CKSelassie, CDSanti, DV Quantitative structure-activity relationships of the inhibition of Pneumocystis carinii dihydrofolate reductase by 4,6-diamino-1,2-dihydro-2,2-dimethyl-1-(X-phenyl)-s-triazines. J Med Chem 38:967-72 (1995)  
Target
Name:
Dihydrofolate reductase
Synonyms:
DYR_PNECA Dihydrofolate reductase Tetrahydrofolate dehydrogenase
Type:
Enzyme
Mol. Mass.:
23891.29
Organism:
Pneumocystis carinii
Description:
Residue:
206
  
Inhibitor
Name:
BDBM50407727
Synonyms:
CHEMBL172558
Type:
Small organic molecule
Emp. Form.:
C17H27N5
Mol. Mass.:
301.4298
SMILES:
CCCCCCc1ccc(cc1)N1C(N)=NC(N)=NC1(C)C
: