Target
5-hydroxytryptamine receptor 2A
Ligand
BDBM50014407
Substrate
Meas. Tech.
ChEMBL_2255 (CHEMBL873476)
IC50
3467.37±n/a nM
Citation
 Rault, SLancelot, JCPrunier, HRobba, MRenard, PDelagrange, PPfeiffer, BCaignard, DHGuardiola-Lemaitre, BHamon, M Novel selective and partial agonists of 5-HT3 receptors. Part 1. Synthesis and biological evaluation of piperazinopyrrolothienopyrazines. J Med Chem 39:2068-80 (1996)  
Target
Name:
5-hydroxytryptamine receptor 2A
Synonyms:
5-HT2A 5HTR2A Serotonin 2a (5-HT2a) receptor
Type:
Enzyme Catalytic Domain
Mol. Mass.:
52578.24
Organism:
BOVINE
Description:
5-HT2A HTR2A BOVINE::Q75Z89
Residue:
470
  
Inhibitor
Name:
BDBM50014407
Synonyms:
2-(piperazin-1-yl)quinoline 2-Piperazin-1-yl-quinoline (Quipazine) CHEMBL18772 | QUIPAZINE
Type:
Small organic molecule
Emp. Form.:
C13H15N3
Mol. Mass.:
213.2783
SMILES:
C1CN(CCN1)c1ccc2ccccc2n1
: