Target
5-hydroxytryptamine receptor 1B
Ligand
BDBM50407765
Substrate
Meas. Tech.
ChEMBL_1400 (CHEMBL873475)
IC50
>100000±n/a nM
Citation
 Rault, SLancelot, JCPrunier, HRobba, MRenard, PDelagrange, PPfeiffer, BCaignard, DHGuardiola-Lemaitre, BHamon, M Novel selective and partial agonists of 5-HT3 receptors. Part 1. Synthesis and biological evaluation of piperazinopyrrolothienopyrazines. J Med Chem 39:2068-80 (1996)  
Target
Name:
5-hydroxytryptamine receptor 1B
Synonyms:
5-HT-1B 5-hydroxytryptamine receptor 1B (5HT1B) 5ht1b Serotonin 1 (5-HT1) receptor Serotonin receptor 1B
Type:
Protein
Mol. Mass.:
43173.33
Organism:
Rattus norvegicus (Rat)
Description:
P28564
Residue:
386
  
Inhibitor
Name:
BDBM50407765
Synonyms:
CHEMBL292293
Type:
Small organic molecule
Emp. Form.:
C13H13N3OS
Mol. Mass.:
259.327
SMILES:
C1CN(CCO1)c1nc2ccsc2n2cccc12
: