Target
5-hydroxytryptamine receptor 2C
Ligand
BDBM50407750
Substrate
Meas. Tech.
ChEMBL_2786 (CHEMBL617855)
IC50
707.95±n/a nM
Citation
 Rault, SLancelot, JCPrunier, HRobba, MRenard, PDelagrange, PPfeiffer, BCaignard, DHGuardiola-Lemaitre, BHamon, M Novel selective and partial agonists of 5-HT3 receptors. Part 1. Synthesis and biological evaluation of piperazinopyrrolothienopyrazines. J Med Chem 39:2068-80 (1996)  
Target
Name:
5-hydroxytryptamine receptor 2C
Synonyms:
5-HT-2C 5-HT2C-INI 5-HTR2C 5-hydroxytryptamine receptor 2C (5-HT-2C) 5HT-1C HTR1C Serotonin (5-HT3) receptor Serotonin Receptor 2C
Type:
G Protein-Coupled Receptor (GPCR)
Mol. Mass.:
51836.79
Organism:
Homo sapiens (Human)
Description:
P28335
Residue:
458
  
Inhibitor
Name:
BDBM50407750
Synonyms:
CHEMBL261977
Type:
Small organic molecule
Emp. Form.:
C22H22N4S
Mol. Mass.:
374.502
SMILES:
C(\C=C\c1ccccc1)N1CCN(CC1)c1nc2ccsc2n2cccc12
: