Target
Acetylcholinesterase
Ligand
BDBM50029938
Substrate
Meas. Tech.
ChEMBL_29696 (CHEMBL636896)
IC50
149.97±n/a nM
Citation
 Tong, WCollantes, ERChen, YWelsh, WJ A comparative molecular field analysis study of N-benzylpiperidines as acetylcholinesterase inhibitors. J Med Chem 39:380-7 (1996)  
Target
Name:
Acetylcholinesterase
Synonyms:
ACES_MOUSE Acetylcholinesterase (mouse AChE) Ache
Type:
Enzyme
Mol. Mass.:
68165.65
Organism:
Mus musculus (mouse)
Description:
Residue:
614
  
Inhibitor
Name:
BDBM50029938
Synonyms:
2-(1-Benzyl-piperidin-4-ylmethyl)-indan-1-one; hydrochloride CHEMBL545560
Type:
Small organic molecule
Emp. Form.:
C22H25NO
Mol. Mass.:
319.44
SMILES:
O=C1C(CC2CCN(Cc3ccccc3)CC2)Cc2ccccc12
: