Target
5-hydroxytryptamine receptor 1D
Ligand
BDBM50408171
Substrate
Meas. Tech.
ChEMBL_1952 (CHEMBL617559)
IC50
1698.24±n/a nM
Citation
 Prunier, HRault, SLancelot, JCRobba, MRenard, PDelagrange, PPfeiffer, BCaignard, DHMisslin, RGuardiola-Lemaitre, BHamon, M Novel and selective partial agonists of 5-HT3 receptors. 2. Synthesis and biological evaluation of piperazinopyridopyrrolopyrazines, piperazinopyrroloquinoxalines, and piperazinopyridopyrroloquinoxalines. J Med Chem 40:1808-19 (1997)  
Target
Name:
5-hydroxytryptamine receptor 1D
Synonyms:
5HT1D_PIG Serotonin 1d (5-HT1d) receptor
Type:
PROTEIN
Mol. Mass.:
32680.56
Organism:
Sus scrofa
Description:
ChEMBL_1963
Residue:
291
  
Inhibitor
Name:
BDBM50408171
Synonyms:
CHEMBL53490
Type:
Small organic molecule
Emp. Form.:
C14H15N5
Mol. Mass.:
253.3024
SMILES:
C1CN(CCN1)c1nc2cccnc2n2cccc12
: