Target
Vascular endothelial growth factor receptor 2
Ligand
BDBM50375638
Substrate
Meas. Tech.
ChEMBL_213948 (CHEMBL811926)
IC50
389±n/a nM
Citation
 Vieth, MCummins, DJ DoMCoSAR: a novel approach for establishing the docking mode that is consistent with the structure-activity relationship. Application to HIV-1 protease inhibitors and VEGF receptor tyrosine kinase inhibitors. J Med Chem 43:3020-32 (2000)  
Target
Name:
Vascular endothelial growth factor receptor 2
Synonyms:
Flk-1 Kdr VGFR2_MOUSE | Vascular endothelial growth factor receptor 2
Type:
PROTEIN
Mol. Mass.:
152506.58
Organism:
Mus musculus
Description:
ChEMBL_1469997
Residue:
1367
  
Inhibitor
Name:
BDBM50375638
Synonyms:
CHEMBL101797
Type:
Small organic molecule
Emp. Form.:
C13H10N2O
Mol. Mass.:
210.2313
SMILES:
O=C1Nc2ccccc2\C1=C/c1ccc[nH]1
: