Target
Tubulin alpha-1A chain
Ligand
BDBM50063845
Substrate
Meas. Tech.
ChEMBL_212206 (CHEMBL817769)
IC50
691.83±n/a nM
Citation
 Zhang, SXFeng, JKuo, SCBrossi, AHamel, ETropsha, ALee, KH Antitumor agents. 199. Three-dimensional quantitative structure-activity relationship study of the colchicine binding site ligands using comparative molecular field analysis. J Med Chem 43:167-76 (2000)  
Target
Name:
Tubulin alpha-1A chain
Synonyms:
TBA1A_PIG Tubulin Tubulin alpha-1A chain
Type:
Protein
Mol. Mass.:
50049.25
Organism:
Sus scrofa (Pig)
Description:
P02550
Residue:
451
  
Inhibitor
Name:
BDBM50063845
Synonyms:
(S)-6-(3-Methoxy-phenyl)-6,7-dihydro-5H-[1,3]dioxolo[4,5-g]quinolin-8-one | CHEMBL16227
Type:
Small organic molecule
Emp. Form.:
C17H15NO4
Mol. Mass.:
297.3053
SMILES:
COc1cccc(c1)[C@@H]1CC(=O)c2cc3OCOc3cc2N1
: