Target
Tubulin alpha-1A chain
Ligand
BDBM50059972
Substrate
Meas. Tech.
ChEMBL_212206 (CHEMBL817769)
IC50
933.25±n/a nM
Citation
 Zhang, SXFeng, JKuo, SCBrossi, AHamel, ETropsha, ALee, KH Antitumor agents. 199. Three-dimensional quantitative structure-activity relationship study of the colchicine binding site ligands using comparative molecular field analysis. J Med Chem 43:167-76 (2000)  
Target
Name:
Tubulin alpha-1A chain
Synonyms:
TBA1A_PIG Tubulin Tubulin alpha-1A chain
Type:
Protein
Mol. Mass.:
50049.25
Organism:
Sus scrofa (Pig)
Description:
P02550
Residue:
451
  
Inhibitor
Name:
BDBM50059972
Synonyms:
5-Methyl-2-naphthalen-1-yl-1H-[1,8]naphthyridin-4-one | CHEMBL51998
Type:
Small organic molecule
Emp. Form.:
C19H14N2O
Mol. Mass.:
286.3273
SMILES:
Cc1ccnc2nc(cc(O)c12)-c1cccc2ccccc12
: