Target
Integrin alpha-V/beta-3
Ligand
BDBM50092511
Substrate
Meas. Tech.
ChEMBL_216951 (CHEMBL823586)
IC50
0.1±n/a nM
Citation
 Duggan, MEDuong, LTFisher, JEHamill, TGHoffman, WFHuff, JRIhle, NCLeu, CTNagy, RMPerkins, JJRodan, SBWesolowski, GWhitman, DBZartman, AERodan, GAHartman, GD Nonpeptide alpha(v)beta(3) antagonists. 1. Transformation of a potent, integrin-selective alpha(IIb)beta(3) antagonist into a potent alpha(v)beta(3) antagonist. J Med Chem 43:3736-45 (2000)  
Target
Name:
Integrin alpha-V/beta-3
Synonyms:
ITGAV/ITGB3 | Integrin beta-3/Vitronectin receptor alpha
Type:
Enzyme
Mol. Mass.:
Description:
Components:
This complex has 2 components.
Component 1
Name:
Integrin alpha-V
Synonyms:
ITAV_HUMAN Integrin alpha-V/alpha-5 VNRA Vitronectin receptor | Vitronectin receptor subunit alpha
Type:
PROTEIN
Mol. Mass.:
116024.92
Organism:
Homo sapiens (Human)
Description:
ChEMBL_582336
Residue:
1048
  
Component 2
Name:
Integrin beta-3
Synonyms:
CD_antigen=CD61 GPIIIa ITGB3 Platelet membrane glycoprotein IIIa
Type:
Protein
Mol. Mass.:
87038.91
Organism:
Homo sapiens (Human)
Description:
P05106
Residue:
788
  
Inhibitor
Name:
BDBM50092511
Synonyms:
3-{4-[2-(6-Amino-pyridin-2-yl)-ethyl]-benzoylamino}-2-(4-iodo-benzenesulfonylamino)-propionic acid | CHEMBL332914
Type:
Small organic molecule
Emp. Form.:
C23H23IN4O5S
Mol. Mass.:
594.422
SMILES:
Nc1cccc(CCc2ccc(cc2)C(=O)NC[C@H](NS(=O)(=O)c2ccc(I)cc2)C(O)=O)n1
: