Target
Progesterone receptor
Ligand
BDBM50409115
Substrate
Meas. Tech.
ChEMBL_144885 (CHEMBL749958)
IC50
0.003600±n/a nM
Citation
 Fuhrmann, UHess-Stumpp, HCleve, ANeef, GSchwede, WHoffmann, JFritzemeier, KHChwalisz, K Synthesis and biological activity of a novel, highly potent progesterone receptor antagonist. J Med Chem 43:5010-6 (2001)  
Target
Name:
Progesterone receptor
Synonyms:
NR3C3 PGR PRGR_HUMAN | progesterone
Type:
Protein
Mol. Mass.:
98979.52
Organism:
Homo sapiens (Human)
Description:
P06401
Residue:
933
  
Inhibitor
Name:
BDBM50409115
Synonyms:
LONAPRISAN
Type:
Small organic molecule
Emp. Form.:
C28H29F5O3
Mol. Mass.:
508.5201
SMILES:
CC(=O)c1ccc(cc1)[C@H]1C[C@@]2(C)[C@@H](CC[C@@]2(O)C(F)(F)C(F)(F)F)[C@@H]2CCC3=CC(=O)CCC3=C12
: