Target
HLA class I histocompatibility antigen, A alpha chain
Ligand
BDBM50409325
Substrate
Meas. Tech.
ChEMBL_47858 (CHEMBL660105)
IC50
33.0±n/a nM
Citation
 Doytchinova, IAFlower, DR Toward the quantitative prediction of T-cell epitopes: coMFA and coMSIA studies of peptides with affinity for the class I MHC molecule HLA-A*0201. J Med Chem 44:3572-81 (2001)  
Target
Name:
HLA class I histocompatibility antigen, A alpha chain
Synonyms:
HLA class I histocompatibility antigen A-3 HLA-A HLAA_HUMAN | MHC class I antigen A*3
Type:
PROTEIN
Mol. Mass.:
40836.72
Organism:
Homo sapiens (Human)
Description:
ChEMBL_47858
Residue:
365
  
Inhibitor
Name:
BDBM50409325
Synonyms:
CHEMBL437069
Type:
Small organic molecule
Emp. Form.:
C42H67N9O14
Mol. Mass.:
922.0333
SMILES:
CC(C)C[C@H](NC(=O)CN)C(=O)N[C@@H](Cc1ccc(O)cc1)C(=O)N[C@@H](CO)C(=O)N[C@@H](CO)C(=O)N[C@@H]([C@@H](C)O)C(=O)N[C@@H](C(C)C)C(=O)N1CCC[C@H]1C(=O)N[C@@H](C(C)C)C(O)=O
: