Target
Acylcarnitine hydrolase
Ligand
BDBM50409666
Substrate
Meas. Tech.
ChEMBL_216226 (CHEMBL823860)
IC50
15848.93±n/a nM
Citation
 Wheelock, CEColvin, MEUemura, IOlmstead, MMSanborn, JRNakagawa, YJones, ADHammock, BD Use of ab initio calculations to predict the biological potency of carboxylesterase inhibitors. J Med Chem 45:5576-93 (2002)  
Target
Name:
Acylcarnitine hydrolase
Synonyms:
Carboxylesterase 2 Ces2c | EST2C_MOUSE
Type:
PROTEIN
Mol. Mass.:
62457.35
Organism:
Mus musculus
Description:
ChEMBL_216226
Residue:
561
  
Inhibitor
Name:
BDBM50409666
Synonyms:
CHEMBL152225
Type:
Small organic molecule
Emp. Form.:
C9H18O2Se
Mol. Mass.:
237.2
SMILES:
CCCCCC[Se](=O)CC(C)=O
: