Target
Carboxylic ester hydrolase
Ligand
BDBM50409669
Substrate
Meas. Tech.
ChEMBL_92659 (CHEMBL877911)
IC50
0.537±n/a nM
Citation
 Wheelock, CEColvin, MEUemura, IOlmstead, MMSanborn, JRNakagawa, YJones, ADHammock, BD Use of ab initio calculations to predict the biological potency of carboxylesterase inhibitors. J Med Chem 45:5576-93 (2002)  
Target
Name:
Carboxylic ester hydrolase
Synonyms:
CG8425-PA [Drosophila melanogaster]
Type:
PROTEIN
Mol. Mass.:
64506.23
Organism:
Drosophila melanogaster
Description:
ChEMBL_92659
Residue:
579
  
Inhibitor
Name:
BDBM50409669
Synonyms:
CHEMBL155514
Type:
Small organic molecule
Emp. Form.:
C9H15F3O2Se
Mol. Mass.:
291.17
SMILES:
CCCCCC[Se](=O)CC(=O)C(F)(F)F
: