Target
Integrase
Ligand
BDBM50029207
Substrate
Meas. Tech.
ChEMBL_88769 (CHEMBL857173)
IC50
7079±n/a nM
Citation
 Buolamwini, JKAssefa, H CoMFA and CoMSIA 3D QSAR and docking studies on conformationally-restrained cinnamoyl HIV-1 integrase inhibitors: exploration of a binding mode at the active site. J Med Chem 45:841-52 (2002)  
Target
Name:
Integrase
Synonyms:
Human immunodeficiency virus type 1 integrase
Type:
PROTEIN
Mol. Mass.:
32231.48
Organism:
Human immunodeficiency virus 1
Description:
ChEMBL_90865
Residue:
288
  
Inhibitor
Name:
BDBM50029207
Synonyms:
(E)-3-(3,4-Dihydroxy-phenyl)-acrylic acid phenethyl ester 3-(3,4-Dihydroxy-phenyl)-acrylic acid phenethyl ester CHEMBL319244 caffeic acid phenethylester caffeic acid phenylethylester phenethyl 3-(3,4-dihydroxyphenyl)acrylate | phenethyl caffeate
Type:
Small organic molecule
Emp. Form.:
C17H16O4
Mol. Mass.:
284.3065
SMILES:
Oc1ccc(\C=C\C(=O)OCCc2ccccc2)cc1O
: