Target
Receptor tyrosine-protein kinase erbB-2
Ligand
BDBM4304
Substrate
Meas. Tech.
ChEMBL_161600 (CHEMBL769140)
IC50
41686.94±n/a nM
Citation
 Kamath, SBuolamwini, JK Receptor-guided alignment-based comparative 3D-QSAR studies of benzylidene malonitrile tyrphostins as EGFR and HER-2 kinase inhibitors. J Med Chem 46:4657-68 (2003)  
Target
Name:
Receptor tyrosine-protein kinase erbB-2
Synonyms:
2.7.10.1 CD_antigen=CD340 ERBB2_HUMAN FASN/HER2 HER2 MLN19 NEU Proto-oncogene Neu Tyrosine kinase-type cell surface receptor HER2 | p185erbB2
Type:
Mol. Mass.:
137894.47
Organism:
Homo sapiens (Human)
Description:
P04626
Residue:
1255
  
Inhibitor
Name:
BDBM4304
Synonyms:
(2E)-2-cyano-3-(3,4-dihydroxyphenyl)-N-phenylprop-2-enamide cid_5328771 | tyrphostin 1
Type:
Small organic molecule
Emp. Form.:
C16H12N2O3
Mol. Mass.:
280.2781
SMILES:
Oc1ccc(\C=C(/C#N)C(=O)Nc2ccccc2)cc1O
: