Target
Receptor tyrosine-protein kinase erbB-2
Ligand
BDBM50036680
Substrate
Meas. Tech.
ChEMBL_161600 (CHEMBL769140)
IC50
1659.59±n/a nM
Citation
 Kamath, SBuolamwini, JK Receptor-guided alignment-based comparative 3D-QSAR studies of benzylidene malonitrile tyrphostins as EGFR and HER-2 kinase inhibitors. J Med Chem 46:4657-68 (2003)  
Target
Name:
Receptor tyrosine-protein kinase erbB-2
Synonyms:
2.7.10.1 CD_antigen=CD340 ERBB2_HUMAN FASN/HER2 HER2 MLN19 NEU Proto-oncogene Neu Tyrosine kinase-type cell surface receptor HER2 | p185erbB2
Type:
Mol. Mass.:
137894.47
Organism:
Homo sapiens (Human)
Description:
P04626
Residue:
1255
  
Inhibitor
Name:
BDBM50036680
Synonyms:
(E)-2-Cyano-3-(4-hydroxy-3-methoxy-5-p-tolylsulfanylmethyl-phenyl)-acrylamide CHEMBL333454
Type:
Small organic molecule
Emp. Form.:
C19H18N2O3S
Mol. Mass.:
354.423
SMILES:
COc1cc(\C=C(/C#N)C(N)=O)cc(CSc2ccc(C)cc2)c1O
: