Target
Histidine-rich protein PFHRP-II
Ligand
BDBM50123575
Substrate
Meas. Tech.
ChEMBL_215891 (CHEMBL820823)
IC50
27.1±n/a nM
Citation
 Ryckebusch, ADeprez-Poulain, RMaes, LDebreu-Fontaine, MAMouray, EGrellier, PSergheraert, C Synthesis and in vitro and in vivo antimalarial activity of N1-(7-chloro-4-quinolyl)-1,4-bis(3-aminopropyl)piperazine derivatives. J Med Chem 46:542-57 (2003)  
Target
Name:
Histidine-rich protein PFHRP-II
Synonyms:
HRP1_PLAFA Histidine-rich protein PFHRP-II
Type:
PROTEIN
Mol. Mass.:
35156.49
Organism:
Plasmodium falciparum
Description:
ChEMBL_500704
Residue:
332
  
Inhibitor
Name:
BDBM50123575
Synonyms:
(3-{4-[3-(Bis-cyclopropylmethyl-amino)-propyl]-piperazin-1-yl}-propyl)-(7-chloro-quinolin-4-yl)-amine N-(3-(4-(3-(bis(cyclopropylmethyl)amino)propyl)piperazin-1-yl)propyl)-7-chloroquinolin-4-amine
Type:
Small organic molecule
Emp. Form.:
C27H40ClN5
Mol. Mass.:
470.093
SMILES:
Clc1ccc2c(NCCCN3CCN(CCCN(CC4CC4)CC4CC4)CC3)ccnc2c1
: