Target
Histidine-rich protein PFHRP-II
Ligand
BDBM50123571
Substrate
Meas. Tech.
ChEMBL_215891 (CHEMBL820823)
IC50
40±n/a nM
Citation
 Ryckebusch, ADeprez-Poulain, RMaes, LDebreu-Fontaine, MAMouray, EGrellier, PSergheraert, C Synthesis and in vitro and in vivo antimalarial activity of N1-(7-chloro-4-quinolyl)-1,4-bis(3-aminopropyl)piperazine derivatives. J Med Chem 46:542-57 (2003)  
Target
Name:
Histidine-rich protein PFHRP-II
Synonyms:
HRP1_PLAFA Histidine-rich protein PFHRP-II
Type:
PROTEIN
Mol. Mass.:
35156.49
Organism:
Plasmodium falciparum
Description:
ChEMBL_500704
Residue:
332
  
Inhibitor
Name:
BDBM50123571
Synonyms:
(7-Chloro-quinolin-4-yl)-(3-{4-[3-(4-nitro-benzylamino)-propyl]-piperazin-1-yl}-propyl)-amine | CHEMBL151514
Type:
Small organic molecule
Emp. Form.:
C26H33ClN6O2
Mol. Mass.:
497.032
SMILES:
[O-][N+](=O)c1ccc(CNCCCN2CCN(CCCNc3ccnc4cc(Cl)ccc34)CC2)cc1
: