Target
Synaptic vesicle glycoprotein 2A
Ligand
BDBM50422539
Substrate
Meas. Tech.
ChEMBL_100153 (CHEMBL857182)
IC50
19900±n/a nM
Citation
 Kenda, BMMatagne, ACTalaga, PEPasau, PMDifferding, ELallemand, BIFrycia, AMMoureau, FGKlitgaard, HVGillard, MRFuks, BMichel, P Discovery of 4-substituted pyrrolidone butanamides as new agents with significant antiepileptic activity. J Med Chem 47:530-49 (2004)  
Target
Name:
Synaptic vesicle glycoprotein 2A
Synonyms:
SV2A_RAT Sv2a | Synaptic vesicle protein 2a
Type:
PROTEIN
Mol. Mass.:
82648.76
Organism:
Rattus norvegicus
Description:
ChEMBL_100153
Residue:
742
  
Inhibitor
Name:
BDBM50422539
Synonyms:
CHEMBL153619
Type:
Small organic molecule
Emp. Form.:
C9H16N2O2
Mol. Mass.:
184.2355
SMILES:
CC[C@H](N1CCC(C)C1=O)C(N)=O
: