Target
Cyclin-dependent kinase inhibitor 1
Ligand
BDBM50410005
Substrate
Meas. Tech.
ChEMBL_312386 (CHEMBL833769)
IC50
2400±n/a nM
Citation
 Wang, YDJohnson, SPowell, DMcGinnis, JPMiranda, MRabindran, SK Inhibition of tumor cell proliferation by thieno[2,3-d]pyrimidin-4(1H)-one-based analogs. Bioorg Med Chem Lett 15:3763-6 (2005)  
Target
Name:
Cyclin-dependent kinase inhibitor 1
Synonyms:
CAP20 CDKN1 CDN1A_HUMAN MDA6 SDI1 | WAF1
Type:
PROTEIN
Mol. Mass.:
18123.15
Organism:
Homo sapiens (Human)
Description:
ChEMBL_312386
Residue:
164
  
Inhibitor
Name:
BDBM50410005
Synonyms:
CHEMBL179110
Type:
Small organic molecule
Emp. Form.:
C16H14N2O2S
Mol. Mass.:
298.36
SMILES:
COc1ccc(cc1)-c1nc2sc3CCCc3c2c(=O)[nH]1
: