Target
Prostaglandin G/H synthase 2
Ligand
BDBM50150216
Substrate
Meas. Tech.
ChEMBL_307267 (CHEMBL875561)
IC50
1070.04±n/a nM
Citation
 Prasanna, SManivannan, EChaturvedi, SC QSAR studies on structurally similar 2-(4-methanesulfonylphenyl)pyran-4-ones as selective COX-2 inhibitors: a Hansch approach. Bioorg Med Chem Lett 15:313-20 (2004)  
Target
Name:
Prostaglandin G/H synthase 2
Synonyms:
COX2 Cyclooxygenase 2 (COX-2) Cyclooxygenase-2 (COX-2 AA) Cyclooxygenase-2 (COX-2) PGH2_HUMAN PHS II Prostaglandin E synthase/G/H synthase 2 Prostaglandin-endoperoxide synthase 2
Type:
Enzyme
Mol. Mass.:
69003.89
Organism:
Homo sapiens (Human)
Description:
Recombinant Cox-2 provided by Cayman (Cayman Chemical Co.,Ann Arbor, MI).
Residue:
604
  
Inhibitor
Name:
BDBM50150216
Synonyms:
3-(4-Fluoro-phenyl)-2-(4-methanesulfonyl-phenyl)-6-methyl-pyran-4-one | CHEMBL338705
Type:
Small organic molecule
Emp. Form.:
C19H15FO4S
Mol. Mass.:
358.383
SMILES:
Cc1cc(=O)c(-c2ccc(F)cc2)c(o1)-c1ccc(cc1)S(C)(=O)=O
: