Target
DNA topoisomerase 2-alpha
Ligand
BDBM50164888
Substrate
Meas. Tech.
ChEMBL_304732 (CHEMBL829332)
IC50
>400000±n/a nM
Citation
 Suzuki, KOkawara, THigashijima, TYokomizo, KMizushima, TOtsuka, M Inhibitory activities against topoisomerase I and II by isoaurostatin derivatives and their structure-activity relationships. Bioorg Med Chem Lett 15:2065-8 (2005)  
Target
Name:
DNA topoisomerase 2-alpha
Synonyms:
DNA topoisomerase 2-alpha DNA topoisomerase II (Topo II) DNA topoisomerase II, alpha isozyme TOP2A Topoisomerase I/II | Topoisomerase II alpha (HuTopoIIα)
Type:
Protein
Mol. Mass.:
174415.30
Organism:
Homo sapiens (Human)
Description:
P11388
Residue:
1531
  
Inhibitor
Name:
BDBM50164888
Synonyms:
6-Hydroxy-3-[1-(4-hydroxy-phenyl)-meth-(E)-ylidene]-3H-benzofuran-2-one isoaurostatin
Type:
Small organic molecule
Emp. Form.:
C15H10O4
Mol. Mass.:
254.2375
SMILES:
Oc1ccc(\C=C2\C(=O)Oc3cc(O)ccc23)cc1
: