Target
Melanocortin receptor 5
Ligand
BDBM50410238
Substrate
Meas. Tech.
ChEMBL_307553 (CHEMBL831266)
IC50
3162±n/a nM
Citation
 Kruijtzer, JANijenhuis, WAWanders, NGispen, WHLiskamp, RMAdan, RA Peptoid-peptide hybrids as potent novel melanocortin receptor ligands. J Med Chem 48:4224-30 (2005)  
Target
Name:
Melanocortin receptor 5
Synonyms:
MC5R_MOUSE Melanocortin receptor 5 | Melanocortin receptor 5 (MC5R)
Type:
Enzyme
Mol. Mass.:
36966.58
Organism:
Mus musculus (Mouse)
Description:
P41149
Residue:
325
  
Inhibitor
Name:
BDBM50410238
Synonyms:
CHEMBL370321
Type:
Small organic molecule
Emp. Form.:
C44H65N13O8
Mol. Mass.:
904.0692
SMILES:
CCCC[C@H](NC(C)=O)C(=O)NCC(=O)N[C@@H](CCCCN)C(=O)N[C@H](Cc1ccccc1)C(=O)N(CCCNC(N)=N)CC(=O)N[C@@H](Cc1c[nH]c2ccccc12)C(=O)NCC(N)=O
: