Target
Melanocortin receptor 3
Ligand
BDBM50410257
Substrate
Meas. Tech.
ChEMBL_307551 (CHEMBL831264)
IC50
3162±n/a nM
Citation
 Kruijtzer, JANijenhuis, WAWanders, NGispen, WHLiskamp, RMAdan, RA Peptoid-peptide hybrids as potent novel melanocortin receptor ligands. J Med Chem 48:4224-30 (2005)  
Target
Name:
Melanocortin receptor 3
Synonyms:
MC3-R MC3R_HUMAN Melanocortin receptor (M3 and M4)
Type:
Enzyme
Mol. Mass.:
36044.86
Organism:
Homo sapiens (Human)
Description:
P41968
Residue:
323
  
Inhibitor
Name:
BDBM50410257
Synonyms:
CHEMBL188738
Type:
Small organic molecule
Emp. Form.:
C45H67N13O8
Mol. Mass.:
918.0958
SMILES:
CCCCN(CC(=O)NCC(=O)N[C@@H](CCCCN)C(=O)N[C@H](Cc1ccccc1)C(=O)N(CCCNC(N)=N)CC(=O)N(CCc1c[nH]c2ccccc12)CC(=O)NCC(N)=O)C(C)=O
: