Target
Seed linoleate 13S-lipoxygenase-1
Ligand
BDBM50410780
Substrate
Meas. Tech.
ChEMBL_334023 (CHEMBL866429)
IC50
200000±n/a nM
Citation
 Doulgkeris, CMGalanakis, DKourounakis, APTsiakitzis, KCGavalas, AMEleftheriou, PTVictoratos, PRekka, EAKourounakis, PN Synthesis and pharmacochemical study of novel polyfunctional molecules combining anti-inflammatory, antioxidant, and hypocholesterolemic properties. Bioorg Med Chem Lett 16:825-9 (2006)  
Target
Name:
Seed linoleate 13S-lipoxygenase-1
Synonyms:
15-LOX 15-lipo-oxygenase (SLO) L-1 LOX1.1 Lipoxygenase (LOX) Lipoxygenase-1 | Seed lipoxygenase-1
Type:
Enzyme
Mol. Mass.:
94365.66
Organism:
Glycine max (soybean)
Description:
Residue:
839
  
Inhibitor
Name:
BDBM50410780
Synonyms:
CHEMBL204505
Type:
Small organic molecule
Emp. Form.:
C29H32ClN3O6S
Mol. Mass.:
586.099
SMILES:
CCOC(=O)C(CS)NC(=O)C1CCCN1C(=O)Cc1c(C)n(C(=O)c2ccc(Cl)cc2)c2ccc(OC)cc12
: