Target
Prostaglandin reductase 1
Ligand
BDBM50410834
Substrate
Meas. Tech.
ChEMBL_341692 (CHEMBL861403)
IC50
1420±n/a nM
Citation
 Gong, JNeels, JFYu, XKensler, TWPeterson, LASturla, SJ Investigating the role of stereochemistry in the activity of anticancer acylfulvenes: synthesis, reductase-mediated bioactivation, and cellular toxicity. J Med Chem 49:2593-9 (2006)  
Target
Name:
Prostaglandin reductase 1
Synonyms:
Dig1 NADP-dependent leukotriene B4 12-hydroxydehydrogenase Ptgr1
Type:
PROTEIN
Mol. Mass.:
35721.48
Organism:
Rattus norvegicus
Description:
ChEMBL_341692
Residue:
329
  
Inhibitor
Name:
BDBM50410834
Synonyms:
CHEMBL380919
Type:
Small organic molecule
Emp. Form.:
C15H18O3
Mol. Mass.:
246.3016
SMILES:
CC1=C(CO)C2=C(C)C3(CC3)[C@](C)(O)C(=O)C2=C1
: