Target
Integrin alpha-V/beta-3
Ligand
BDBM50191298
Substrate
Meas. Tech.
ChEMBL_366374 (CHEMBL866015)
IC50
>1000±n/a nM
Citation
 Dayam, RAiello, FDeng, JWu, YGarofalo, AChen, XNeamati, N Discovery of small molecule integrin alphavbeta3 antagonists as novel anticancer agents. J Med Chem 49:4526-34 (2006)  
Target
Name:
Integrin alpha-V/beta-3
Synonyms:
ITGAV/ITGB3 | Integrin beta-3/Vitronectin receptor alpha
Type:
Enzyme
Mol. Mass.:
Description:
Components:
This complex has 2 components.
Component 1
Name:
Integrin alpha-V
Synonyms:
ITAV_HUMAN Integrin alpha-V/alpha-5 VNRA Vitronectin receptor | Vitronectin receptor subunit alpha
Type:
PROTEIN
Mol. Mass.:
116024.92
Organism:
Homo sapiens (Human)
Description:
ChEMBL_582336
Residue:
1048
  
Component 2
Name:
Integrin beta-3
Synonyms:
CD_antigen=CD61 GPIIIa ITGB3 Platelet membrane glycoprotein IIIa
Type:
Protein
Mol. Mass.:
87038.91
Organism:
Homo sapiens (Human)
Description:
P05106
Residue:
788
  
Inhibitor
Name:
BDBM50191298
Synonyms:
3-(5-{[6-(4-fluoro-phenylamino)-[1,2,5]oxadiazolo[3,4-b]pyrazin-5-yl]-hydrazonomethyl}-furan-2-yl)-benzoic acid | CHEMBL214002
Type:
Small organic molecule
Emp. Form.:
C22H14FN7O4
Mol. Mass.:
459.3895
SMILES:
OC(=O)c1cccc(c1)-c1ccc(CN=Nc2nc3nonc3nc2Nc2ccc(F)cc2)o1
: