Target
Tryptase beta-2
Ligand
BDBM50411009
Substrate
Meas. Tech.
ChEMBL_370996 (CHEMBL868494)
Ki
3.7±n/a nM
Citation
 Palmer, JTRydzewski, RMMendonca, RVSperandio, DSpencer, JRHirschbein, BLLohman, JBeltman, JNguyen, MLiu, L Design and synthesis of selective keto-1,2,4-oxadiazole-based tryptase inhibitors. Bioorg Med Chem Lett 16:3434-9 (2006)  
Target
Name:
Tryptase beta-2
Synonyms:
TPS2 TRYB2_HUMAN Tryptase II Tryptase-2
Type:
PROTEIN
Mol. Mass.:
30518.79
Organism:
Homo sapiens (Human)
Description:
ChEMBL_210702
Residue:
275
  
Inhibitor
Name:
BDBM50411009
Synonyms:
CHEMBL538574
Type:
Small organic molecule
Emp. Form.:
C26H30Cl2N4O5
Mol. Mass.:
549.446
SMILES:
COCC(=O)N[C@@H](CCCCN)C(=O)c1noc(Cc2ccc(OCCc3ccc(Cl)c(Cl)c3)cc2)n1
: