Target
Vitamin D3 receptor
Ligand
BDBM50411124
Substrate
Meas. Tech.
ChEMBL_412322 (CHEMBL910037)
IC50
6.2±n/a nM
Citation
 Saito, NMatsunaga, TSaito, HAnzai, MTakenouchi, KMiura, DNamekawa, JIshizuka, SKittaka, A Further synthetic and biological studies on vitamin D hormone antagonists based on C24-alkylation and C2alpha-functionalization of 25-dehydro-1alpha-hydroxyvitamin D(3)-26,23-lactones. J Med Chem 49:7063-75 (2006)  
Target
Name:
Vitamin D3 receptor
Synonyms:
1,25-dihydroxyvitamin D3 receptor Nuclear receptor subfamily 1 group I member 1 VDR | VDR_HUMAN
Type:
Protein
Mol. Mass.:
48288.72
Organism:
Homo sapiens (Human)
Description:
P11473
Residue:
427
  
Inhibitor
Name:
BDBM50411124
Synonyms:
CHEMBL217385
Type:
Small organic molecule
Emp. Form.:
C31H46O5
Mol. Mass.:
498.6939
SMILES:
C[C@H](C[C@@H]1OC(=O)C(=C)[C@@H]1C)[C@H]1CC[C@H]2\C(CCC[C@]12C)=C\C=C1\C[C@@H](O)[C@H](CCCO)[C@H](O)C1=C
: