Target
Amine oxidase [flavin-containing] B
Ligand
BDBM50409101
Substrate
Meas. Tech.
ChEMBL_417161 (CHEMBL909462)
IC50
0.912±n/a nM
Citation
 Novaroli, LDaina, AFavre, EBravo, JCarotti, ALeonetti, FCatto, MCarrupt, PAReist, M Impact of species-dependent differences on screening, design, and development of MAO B inhibitors. J Med Chem 49:6264-72 (2006)  
Target
Name:
Amine oxidase [flavin-containing] B
Synonyms:
AOFB_HUMAN MAOB Monoamine oxidase type B (MAO B) Monoamine oxidase type B (MAOB)
Type:
Protein
Mol. Mass.:
58768.76
Organism:
Homo sapiens (Human)
Description:
P27338
Residue:
520
  
Inhibitor
Name:
BDBM50409101
Synonyms:
CHEMBL142799
Type:
Small organic molecule
Emp. Form.:
C19H16O3
Mol. Mass.:
292.3285
SMILES:
O=c1oc2cc(OCc3ccccc3)ccc2c2CCCc12
: