Target
Amine oxidase [flavin-containing] B
Ligand
BDBM50409086
Substrate
Meas. Tech.
ChEMBL_417161 (CHEMBL909462)
IC50
1.38±n/a nM
Citation
 Novaroli, LDaina, AFavre, EBravo, JCarotti, ALeonetti, FCatto, MCarrupt, PAReist, M Impact of species-dependent differences on screening, design, and development of MAO B inhibitors. J Med Chem 49:6264-72 (2006)  
Target
Name:
Amine oxidase [flavin-containing] B
Synonyms:
AOFB_HUMAN MAOB Monoamine oxidase type B (MAO B) Monoamine oxidase type B (MAOB)
Type:
Protein
Mol. Mass.:
58768.76
Organism:
Homo sapiens (Human)
Description:
P27338
Residue:
520
  
Inhibitor
Name:
BDBM50409086
Synonyms:
CHEMBL348922
Type:
Small organic molecule
Emp. Form.:
C18H17NO2
Mol. Mass.:
279.3331
SMILES:
Cc1c(C)c(=O)oc2cc(NCc3ccccc3)ccc12
: