Target
Amine oxidase [flavin-containing] B
Ligand
BDBM50409093
Substrate
Meas. Tech.
ChEMBL_417161 (CHEMBL909462)
IC50
1.66±n/a nM
Citation
 Novaroli, LDaina, AFavre, EBravo, JCarotti, ALeonetti, FCatto, MCarrupt, PAReist, M Impact of species-dependent differences on screening, design, and development of MAO B inhibitors. J Med Chem 49:6264-72 (2006)  
Target
Name:
Amine oxidase [flavin-containing] B
Synonyms:
AOFB_HUMAN MAOB Monoamine oxidase type B (MAO B) Monoamine oxidase type B (MAOB)
Type:
Protein
Mol. Mass.:
58768.76
Organism:
Homo sapiens (Human)
Description:
P27338
Residue:
520
  
Inhibitor
Name:
BDBM50409093
Synonyms:
CHEMBL111310
Type:
Small organic molecule
Emp. Form.:
C19H18O4
Mol. Mass.:
310.3438
SMILES:
COc1cccc(COc2ccc3c(C)c(C)c(=O)oc3c2)c1
: