Target
Neuronal acetylcholine receptor subunit alpha-4/beta-2
Ligand
BDBM50201051
Substrate
Meas. Tech.
ChEMBL_422886 (CHEMBL907056)
EC50
2200±n/a nM
Citation
 Frost, JMBunnelle, WHTietje, KRAnderson, DJRueter, LECurzon, PSurowy, CSJi, JDaanen, JFKohlhaas, KLBuckley, MJHenry, RFDyhring, TAhring, PKMeyer, MD Synthesis and structure-activity relationships of 3,8-diazabicyclo[4.2.0]octane ligands, potent nicotinic acetylcholine receptor agonists. J Med Chem 49:7843-53 (2006)  
Target
Name:
Neuronal acetylcholine receptor subunit alpha-4/beta-2
Synonyms:
Neuronal acetylcholine receptor Alpha-4/Beta-2 Neuronal acetylcholine receptor; alpha4/beta2 | nAChR subtypes alpha4 beta2
Type:
Protein
Mol. Mass.:
Description:
Components:
This complex has 2 components.
Component 1
Name:
Neuronal acetylcholine receptor subunit alpha-4
Synonyms:
ACHA4_HUMAN CHRNA4 protein Neuronal acetylcholine receptor protein alpha-4 subunit Nicotinic acetylcholine receptor alpha4/beta2/alpha5
Type:
Mol. Mass.:
69963.49
Organism:
Homo sapiens (Human)
Description:
NACHRA4
Residue:
627
  
Component 2
Name:
Neuronal acetylcholine receptor subunit beta-2
Synonyms:
ACHB2_HUMAN Neuronal acetylcholine receptor protein beta-2 subunit | Nicotinic acetylcholine receptor alpha3/beta2/alpha5
Type:
Protein
Mol. Mass.:
57020.50
Organism:
Homo sapiens (Human)
Description:
P17787
Residue:
502
  
Inhibitor
Name:
BDBM50201051
Synonyms:
(1R,6S)-3-(6-methoxy-pyridin-3-yl)-3,8-diaza-bicyclo[4.2.0]octane CHEMBL373763
Type:
Small organic molecule
Emp. Form.:
C12H17N3O
Mol. Mass.:
219.2829
SMILES:
COc1ccc(cn1)N1CC[C@H]2CN[C@H]2C1
: