Target
Neuronal acetylcholine receptor subunit alpha-4/beta-2
Ligand
BDBM50411223
Substrate
Meas. Tech.
ChEMBL_422886 (CHEMBL907056)
EC50
340±n/a nM
Citation
 Frost, JMBunnelle, WHTietje, KRAnderson, DJRueter, LECurzon, PSurowy, CSJi, JDaanen, JFKohlhaas, KLBuckley, MJHenry, RFDyhring, TAhring, PKMeyer, MD Synthesis and structure-activity relationships of 3,8-diazabicyclo[4.2.0]octane ligands, potent nicotinic acetylcholine receptor agonists. J Med Chem 49:7843-53 (2006)  
Target
Name:
Neuronal acetylcholine receptor subunit alpha-4/beta-2
Synonyms:
Neuronal acetylcholine receptor Alpha-4/Beta-2 Neuronal acetylcholine receptor; alpha4/beta2 | nAChR subtypes alpha4 beta2
Type:
Protein
Mol. Mass.:
Description:
Components:
This complex has 2 components.
Component 1
Name:
Neuronal acetylcholine receptor subunit alpha-4
Synonyms:
ACHA4_HUMAN CHRNA4 protein Neuronal acetylcholine receptor protein alpha-4 subunit Nicotinic acetylcholine receptor alpha4/beta2/alpha5
Type:
Mol. Mass.:
69963.49
Organism:
Homo sapiens (Human)
Description:
NACHRA4
Residue:
627
  
Component 2
Name:
Neuronal acetylcholine receptor subunit beta-2
Synonyms:
ACHB2_HUMAN Neuronal acetylcholine receptor protein beta-2 subunit | Nicotinic acetylcholine receptor alpha3/beta2/alpha5
Type:
Protein
Mol. Mass.:
57020.50
Organism:
Homo sapiens (Human)
Description:
P17787
Residue:
502
  
Inhibitor
Name:
BDBM50411223
Synonyms:
CHEMBL463862
Type:
Small organic molecule
Emp. Form.:
C12H15BrN4O
Mol. Mass.:
311.178
SMILES:
NC(=O)c1cc(cnc1Br)N1C[C@H]2CCNC[C@@H]12
: