Target
Gastrin/cholecystokinin type B receptor
Ligand
BDBM50410544
Substrate
Meas. Tech.
ChEMBL_439007 (CHEMBL889353)
Ki
11±n/a nM
Citation
 McDonald, IMBlack, JWBuck, IMDunstone, DJGriffin, EPHarper, EAHull, RAKalindjian, SBLilley, EJLinney, IDPether, MJRoberts, SPShaxted, MESpencer, JSteel, KISykes, DAWalker, MKWatt, GFWright, LWright, PTXun, W Optimization of 1,3,4-benzotriazepine-based CCK(2) antagonists to obtain potent, orally active inhibitors of gastrin-mediated gastric acid secretion. J Med Chem 50:3101-12 (2007)  
Target
Name:
Gastrin/cholecystokinin type B receptor
Synonyms:
CCKBR Cholecystokinin B receptor Gastrin/cholecystokinin type B receptor
Type:
Enzyme Catalytic Domain
Mol. Mass.:
48544.19
Organism:
Dog
Description:
Cholecystokinin B 0 Dog::P30552
Residue:
453
  
Inhibitor
Name:
BDBM50410544
Synonyms:
CHEMBL390519
Type:
Small organic molecule
Emp. Form.:
C28H35N3O4
Mol. Mass.:
477.5952
SMILES:
OC(=O)c1cccc(NC(=O)c2[nH]c(nc2COC23CC4CC(CC(C4)C2)C3)C2CCCCC2)c1
: