Target
Cyclin-dependent kinase 5 activator 1
Ligand
BDBM50218358
Substrate
Meas. Tech.
ChEMBL_448768 (CHEMBL897914)
IC50
34±n/a nM
Citation
 Shiradkar, MRPadhalingappa, MBBhetalabhotala, SAkula, KCTupe, DAPinninti, RRThummanagoti, S A novel approach to cyclin-dependent kinase 5/p25 inhibitors: A potential treatment for Alzheimer's disease. Bioorg Med Chem 15:6397-406 (2007)  
Target
Name:
Cyclin-dependent kinase 5 activator 1
Synonyms:
CDK5/p35 Cyclin-dependent kinase 5 regulatory subunit 1 | Cyclin-dependent kinase 5/CDK5 activator 1
Type:
Protein Complex
Mol. Mass.:
Description:
Components:
This complex has 2 components.
Component 1
Name:
Cyclin-dependent kinase 5
Synonyms:
CDK5 CDKN5 Cyclin-dependent kinase 5 (CDK5/ p25) Cyclin-dependent-like kinase 5 PSSALRE Tau protein kinase II catalytic subunit
Type:
Enzyme Subunit
Mol. Mass.:
33308.61
Organism:
Homo sapiens (Human)
Description:
Residue:
292
  
Component 2
Name:
Cyclin-dependent kinase 5 activator 1
Synonyms:
CD5R1_HUMAN CDK5R1 Cyclin-dependent kinase 5 (CDK5/p25) NCK5A p35
Type:
Enzyme Subunit
Mol. Mass.:
34077.43
Organism:
Homo sapiens (Human)
Description:
Q15078
Residue:
307
  
Inhibitor
Name:
BDBM50218358
Synonyms:
CHEMBL238789 | N1-[4-methyl-5-(5H-[1,2,4]triazolo[3',4':2,3][1,3,4]-thiadiazino[5,6-b]quinoxalin-3-yl)-2-thienyl]-acetamide
Type:
Small organic molecule
Emp. Form.:
C17H13N7OS2
Mol. Mass.:
395.461
SMILES:
CC(=O)Nc1cc(C)c(s1)-c1nnc2Sc3nc4ccccc4nc3Nn12
: